Reaction Details
TargetTyrosine-protein kinase JAK2
LigandBDBM332994
Substrate/Competitorn/a
Ki<10±n/a nM
Citation Masse, CEGreenwood, JRRomero, DLHarriman, GCWester, RTShelley, MKennedy-Smith, JJDahlgren, M TYK2 inhibitors and uses thereof US Patent US10196390 Publication Date 2/5/2019
 
Tyrosine-protein kinase JAK2
Name:Tyrosine-protein kinase JAK2
Type:Protein
Mol. Mass.:130684.68
Organism:Homo sapiens (Human)
Description:O60674
Residue:1132
BDBM332994
NameBDBM332994
Synonyms:US10196390, Compound I-283
TypeSmall organic molecule
Emp. Form.C25H20F4N4O2
Mol. Mass.484.4455
SMILESFc1cccc(F)c1-c1cc(Nc2ccc(cc2)C(=O)N2CCC(F)(F)CC2)c2C(=O)NCc2n1