Reaction Details
TargetCoagulation factor X
LigandBDBM12694
Substrate/CompetitorBDBM12658
Meas. Tech.Enzyme Assay and Determination of the Inhibition Constants.
pH7±n/a
Temperature295.15±n/a K
Ki 0.12±n/a nM
Citation Pinto, DJOrwat, MJQuan, MLHan, QGalemmo, RAAmparo, EWells, BEllis, CHe, MYAlexander, RSRossi, KASmallwood, AWong, PCLuettgen, JMRendina, ARKnabb, RMMersinger, LKettner, CBai, SHe, KWexler, RRLam, PY 1-[3-Aminobenzisoxazol-5'-yl]-3-trifluoromethyl-6-[2'-(3-(R)-hydroxy-N-pyrrolidinyl)methyl-[1,1']-biphen-4-yl]-1,4,5,6-tetrahydropyrazolo-[3,4-c]-pyridin-7-one (BMS-740808) a highly potent, selective, efficacious, and orally bioavailable inhibitor of blood coagulation factor Xa. Bioorg Med Chem Lett16:4141-7 (2006) 
 
Coagulation factor X
Name:Coagulation factor X
Type:Enzyme
Mol. Mass.:54726.60
Organism:Homo sapiens (Human)
Description:n/a
Residue:488
BDBM12694
BDBM12658
NameBDBM12694
Synonyms:1-(3-amino-1,2-benzoxazol-5-yl)-6-[4-(2-{[(3S)-3-hydroxypyrrolidin-1-yl]methyl}phenyl)phenyl]-3-(trifluoromethyl)-1H,4H,5H,6H,7H-pyrazolo[3,4-c]pyridin-7-one | BMS-740808 Analogue 6g
TypeSmall organic molecule
Emp. Form.C31H27F3N6O3
Mol. Mass.588.5797
SMILESNc1noc2ccc(cc12)-n1nc(c2CCN(C(=O)c12)c1ccc(cc1)-c1ccccc1CN1CC[C@H](O)C1)C(F)(F)F