Reaction Details
TargetCoagulation factor X
LigandBDBM12710
Substrate/CompetitorBDBM12658
Meas. Tech.Enzyme Assay and Determination of the Inhibition Constants.
pH7±n/a
Temperature295.15±n/a K
Ki 1.7±n/a nM
Citation Fevig, JMCacciola, JBuriak, JRossi, KAKnabb, RMLuettgen, JMWong, PCBai, SAWexler, RRLam, PY Preparation of 1-(4-methoxyphenyl)-1H-pyrazolo[4,3-d]pyrimidin-7(6H)-ones as potent, selective and bioavailable inhibitors of coagulation factor Xa. Bioorg Med Chem Lett16:3755-60 (2006) 
 
Coagulation factor X
Name:Coagulation factor X
Type:Enzyme
Mol. Mass.:54726.60
Organism:Homo sapiens (Human)
Description:n/a
Residue:488
BDBM12710
BDBM12658
NameBDBM12710
Synonyms:1-(4-methoxyphenyl)-7-oxo-6-[4-(2-sulfamoylphenyl)phenyl]-1H,6H,7H-pyrazolo[4,3-d]pyrimidine-3-carboxamide | pyrazolo[4,3-d]pyrimidinone 22
TypeSmall organic molecule
Emp. Form.C25H20N6O5S
Mol. Mass.516.529
SMILESCOc1ccc(cc1)-n1nc(C(N)=O)c2ncn(-c3ccc(cc3)-c3ccccc3S(N)(=O)=O)c(=O)c12