Reaction Details
TargetCoagulation factor X
LigandBDBM12717
Substrate/CompetitorBDBM12658
Meas. Tech.Enzyme Assay and Determination of the Inhibition Constants.
Ki 3.6±n/a nM
Citation Fevig, JMCacciola, JBuriak, JRossi, KAKnabb, RMLuettgen, JMWong, PCBai, SAWexler, RRLam, PY Preparation of 1-(4-methoxyphenyl)-1H-pyrazolo[4,3-d]pyrimidin-7(6H)-ones as potent, selective and bioavailable inhibitors of coagulation factor Xa. Bioorg Med Chem Lett16:3755-60 (2006) 
 
Coagulation factor X
Name:Coagulation factor X
Type:Enzyme
Mol. Mass.:54726.60
Organism:Homo sapiens (Human)
Description:n/a
Residue:488
BDBM12717
BDBM12658
NameBDBM12717
Synonyms:ethyl 6-{2-fluoro-4-[2-(pyrrolidin-1-ylmethyl)phenyl]phenyl}-1-(4-methoxyphenyl)-7-oxo-1H,6H,7H-pyrazolo[4,3-d]pyrimidine-3-carboxylate | pyrazolo[4,3-d]pyrimidinone 38b
TypeSmall organic molecule
Emp. Form.C32H30FN5O4
Mol. Mass.567.6101
SMILESCCOC(=O)c1nn(-c2ccc(OC)cc2)c2c1ncn(-c1ccc(cc1F)-c1ccccc1CN1CCCC1)c2=O