Reaction Details
TargetCoagulation factor X
LigandBDBM12721
Substrate/CompetitorBDBM12658
Meas. Tech.Enzyme Assay and Determination of the Inhibition Constants.
Ki 1.5±n/a nM
Citation Fevig, JMCacciola, JBuriak, JRossi, KAKnabb, RMLuettgen, JMWong, PCBai, SAWexler, RRLam, PY Preparation of 1-(4-methoxyphenyl)-1H-pyrazolo[4,3-d]pyrimidin-7(6H)-ones as potent, selective and bioavailable inhibitors of coagulation factor Xa. Bioorg Med Chem Lett16:3755-60 (2006) 
 
Coagulation factor X
Name:Coagulation factor X
Type:Enzyme
Mol. Mass.:54726.60
Organism:Homo sapiens (Human)
Description:n/a
Residue:488
BDBM12721
BDBM12658
NameBDBM12721
Synonyms:6-[4-(2-{[(3R)-3-hydroxypyrrolidin-1-yl]methyl}phenyl)phenyl]-1-(4-methoxyphenyl)-7-oxo-1H,6H,7H-pyrazolo[4,3-d]pyrimidine-3-carboxamide | pyrazolo[4,3-d]pyrimidinone 39c
TypeSmall organic molecule
Emp. Form.C30H28N6O4
Mol. Mass.536.5811
SMILESCOc1ccc(cc1)-n1nc(C(N)=O)c2ncn(-c3ccc(cc3)-c3ccccc3CN3CC[C@@H](O)C3)c(=O)c12