Reaction Details
TargetCoagulation factor X
LigandBDBM12726
Substrate/CompetitorBDBM12658
Meas. Tech.Enzyme Assay and Determination of the Inhibition Constants.
Ki 1.4±n/a nM
Citation Fevig, JMCacciola, JBuriak, JRossi, KAKnabb, RMLuettgen, JMWong, PCBai, SAWexler, RRLam, PY Preparation of 1-(4-methoxyphenyl)-1H-pyrazolo[4,3-d]pyrimidin-7(6H)-ones as potent, selective and bioavailable inhibitors of coagulation factor Xa. Bioorg Med Chem Lett16:3755-60 (2006) 
 
Coagulation factor X
Name:Coagulation factor X
Type:Enzyme
Mol. Mass.:54726.60
Organism:Homo sapiens (Human)
Description:n/a
Residue:488
BDBM12726
BDBM12658
NameBDBM12726
Synonyms:1-(4-methoxyphenyl)-5-methyl-6-{4-[2-(pyrrolidin-1-ylmethyl)phenyl]phenyl}-3-(1H-1,2,3,4-tetrazol-1-ylmethyl)-1H,6H,7H-pyrazolo[4,3-d]pyrimidin-7-one | pyrazolo[4,3-d]pyrimidinone 43b
TypeSmall organic molecule
Emp. Form.C32H31N9O2
Mol. Mass.573.6476
SMILESCOc1ccc(cc1)-n1nc(Cn2cnnn2)c2nc(C)n(-c3ccc(cc3)-c3ccccc3CN3CCCC3)c(=O)c12