Reaction Details
TargetGenome polyprotein
LigandBDBM333049
Substrate/Competitorn/a
Meas. Tech.HBsAg Assay
IC50 1073±n/a nM
Citation Cheng, ZWang, MYang, S Tetrahydropyridopyrimidines and tetrahydropyridopyridines for the treatment and prophylaxis of hepatitis B virus infection US Patent US10196391 Publication Date 2/5/2019
 
Genome polyprotein
Name:Genome polyprotein
Type:PROTEIN
Mol. Mass.:312770.83
Organism:Hepatitis GB virus B
Description:ChEMBL_330657
Residue:2864
BDBM333049
NameBDBM333049
Synonyms:US10196391, Example 49
TypeSmall organic molecule
Emp. Form.C18H14Cl2N4
Mol. Mass.357.237
SMILESClc1ccc(cc1Cl)N1CCc2nc(ncc2C1)-c1ccccn1