Reaction Details
TargetGenome polyprotein
LigandBDBM333068
Substrate/Competitorn/a
Meas. Tech.HBsAg Assay
IC50 1466±n/a nM
Citation Cheng, ZWang, MYang, S Tetrahydropyridopyrimidines and tetrahydropyridopyridines for the treatment and prophylaxis of hepatitis B virus infection US Patent US10196391 Publication Date 2/5/2019
 
Genome polyprotein
Name:Genome polyprotein
Type:PROTEIN
Mol. Mass.:312770.83
Organism:Hepatitis GB virus B
Description:ChEMBL_330657
Residue:2864
BDBM333068
NameBDBM333068
Synonyms:6-(5-chloro-4-methoxy-pyrimidin-2-yl)-2-(2-pyridyl)-7,8-dihydro-5H-pyrido[4,3-d]pyrimidine | US10196391, Example 68
TypeSmall organic molecule
Emp. Form.C17H15ClN6O
Mol. Mass.354.794
SMILESCOc1nc(ncc1Cl)N1CCc2nc(ncc2C1)-c1ccccn1