Reaction Details
TargetGenome polyprotein
LigandBDBM333070
Substrate/Competitorn/a
Meas. Tech.HBsAg Assay
IC50 1550±n/a nM
Citation Cheng, ZWang, MYang, S Tetrahydropyridopyrimidines and tetrahydropyridopyridines for the treatment and prophylaxis of hepatitis B virus infection US Patent US10196391 Publication Date 2/5/2019
 
Genome polyprotein
Name:Genome polyprotein
Type:PROTEIN
Mol. Mass.:312770.83
Organism:Hepatitis GB virus B
Description:ChEMBL_330657
Residue:2864
BDBM333070
NameBDBM333070
Synonyms:6-(5-fluoro-4-methoxy-2-pyridyl)-2-(2-pyridyl)-7,8-dihydro-5H-pyrido[4,3-d]pyrimidine | US10196391, Example 70
TypeSmall organic molecule
Emp. Form.C18H16FN5O
Mol. Mass.337.3509
SMILESCOc1ccnc(N2CCc3nc(ncc3C2)-c2ccccn2)c1F