Reaction Details
TargetGenome polyprotein
LigandBDBM333077
Substrate/Competitorn/a
Meas. Tech.HBsAg Assay
IC50 265±n/a nM
Citation Cheng, ZWang, MYang, S Tetrahydropyridopyrimidines and tetrahydropyridopyridines for the treatment and prophylaxis of hepatitis B virus infection US Patent US10196391 Publication Date 2/5/2019
 
Genome polyprotein
Name:Genome polyprotein
Type:PROTEIN
Mol. Mass.:312770.83
Organism:Hepatitis GB virus B
Description:ChEMBL_330657
Residue:2864
BDBM333077
NameBDBM333077
Synonyms:US10196391, Example 77
TypeSmall organic molecule
Emp. Form.C19H15FN6O
Mol. Mass.362.3604
SMILESCOc1cc(cc(F)c1C#N)N1CCc2nc(ncc2C1)-c1ncccn1