Reaction Details
TargetGenome polyprotein
LigandBDBM333079
Substrate/Competitorn/a
Meas. Tech.HBsAg Assay
IC50 288±n/a nM
Citation Cheng, ZWang, MYang, S Tetrahydropyridopyrimidines and tetrahydropyridopyridines for the treatment and prophylaxis of hepatitis B virus infection US Patent US10196391 Publication Date 2/5/2019
 
Genome polyprotein
Name:Genome polyprotein
Type:PROTEIN
Mol. Mass.:312770.83
Organism:Hepatitis GB virus B
Description:ChEMBL_330657
Residue:2864
BDBM333079
NameBDBM333079
Synonyms:US10196391, Example 79
TypeSmall organic molecule
Emp. Form.C18H15ClFN5O
Mol. Mass.371.796
SMILESCOc1cc(cc(Cl)c1F)N1CCc2nc(ncc2C1)-c1ncccn1