Reaction Details
TargetGenome polyprotein
LigandBDBM333096
Substrate/Competitorn/a
Meas. Tech.HBsAg Assay
IC50 162±n/a nM
Citation Cheng, ZWang, MYang, S Tetrahydropyridopyrimidines and tetrahydropyridopyridines for the treatment and prophylaxis of hepatitis B virus infection US Patent US10196391 Publication Date 2/5/2019
 
Genome polyprotein
Name:Genome polyprotein
Type:PROTEIN
Mol. Mass.:312770.83
Organism:Hepatitis GB virus B
Description:ChEMBL_330657
Residue:2864
BDBM333096
NameBDBM333096
Synonyms:US10196391, Example 96
TypeSmall organic molecule
Emp. Form.C20H17F2N3O
Mol. Mass.353.3653
SMILESCOc1cc(cc(F)c1F)N1CCc2cc(ncc2C1)-c1ccccn1