Reaction Details
TargetGenome polyprotein
LigandBDBM333104
Substrate/Competitorn/a
Meas. Tech.HBsAg Assay
IC50 1244±n/a nM
Citation Cheng, ZWang, MYang, S Tetrahydropyridopyrimidines and tetrahydropyridopyridines for the treatment and prophylaxis of hepatitis B virus infection US Patent US10196391 Publication Date 2/5/2019
 
Genome polyprotein
Name:Genome polyprotein
Type:PROTEIN
Mol. Mass.:312770.83
Organism:Hepatitis GB virus B
Description:ChEMBL_330657
Residue:2864
BDBM333104
NameBDBM333104
Synonyms:US10196391, Example 104
TypeSmall organic molecule
Emp. Form.C20H16F4N6O
Mol. Mass.432.3743
SMILESFc1cc(cc(c1)C(=O)NCC(F)(F)F)N1CCc2nc(ncc2C1)-c1ncccn1