Reaction Details
TargetGenome polyprotein
LigandBDBM333080
Substrate/Competitorn/a
Meas. Tech.HBV DNA Assay
IC50 160±0 nM
Citation Cheng, ZWang, MYang, S Tetrahydropyridopyrimidines and tetrahydropyridopyridines for the treatment and prophylaxis of hepatitis B virus infection US Patent US10196391 Publication Date 2/5/2019
 
Genome polyprotein
Name:Genome polyprotein
Type:PROTEIN
Mol. Mass.:312770.83
Organism:Hepatitis GB virus B
Description:ChEMBL_330657
Residue:2864
BDBM333080
NameBDBM333080
Synonyms:US10196391, Example 80
TypeSmall organic molecule
Emp. Form.C19H18N4O3S
Mol. Mass.382.436
SMILESCS(=O)(=O)c1ccc(cc1)N1CCc2nc(nc(O)c2C1)-c1ccccn1