Reaction Details
TargetCoagulation factor X
LigandBDBM12759
Substrate/CompetitorBDBM12658
Meas. Tech.Enzyme Assay and Determination of the Inhibition Constants.
pH7±n/a
Temperature295.15±n/a K
Ki 0.25±n/a nM
Citation Smallheer, JMAlexander, RSWang, JWang, SNakajima, SRossi, KASmallwood, ABarbera, FBurdick, DLuettgen, JMKnabb, RMWexler, RRJadhav, PK SAR and factor IXa crystal structure of a dual inhibitor of factors IXa and Xa. Bioorg Med Chem Lett14:5263-7 (2004) 
 
Coagulation factor X
Name:Coagulation factor X
Type:Enzyme
Mol. Mass.:54726.60
Organism:Homo sapiens (Human)
Description:n/a
Residue:488
BDBM12759
BDBM12658
NameBDBM12759
Synonyms:1-(3-carbamimidoylphenyl)-N-[4-(6-chloro-1H-1,3-benzodiazol-1-yl)-2-fluorophenyl]-3-(trifluoromethyl)-1H-pyrazole-5-carboxamide | pyrazole analog 3h
TypeSmall organic molecule
Emp. Form.C25H16ClF4N7O
Mol. Mass.541.887
SMILESNC(=N)c1cccc(c1)-n1nc(cc1C(=O)Nc1ccc(cc1F)-n1cnc2ccc(Cl)cc12)C(F)(F)F