Reaction Details
TargetCoagulation factor IX
LigandBDBM12761
Substrate/CompetitorBDBM12774
Meas. Tech.Enzyme Assay and Determination of the Inhibition Constants.
Ki 10±n/a nM
Citation Smallheer, JMAlexander, RSWang, JWang, SNakajima, SRossi, KASmallwood, ABarbera, FBurdick, DLuettgen, JMKnabb, RMWexler, RRJadhav, PK SAR and factor IXa crystal structure of a dual inhibitor of factors IXa and Xa. Bioorg Med Chem Lett14:5263-7 (2004) 
 
Coagulation factor IX
Name:Coagulation factor IX
Type:Enzyme
Mol. Mass.:51768.83
Organism:Homo sapiens (Human)
Description:P00740
Residue:461
BDBM12761
BDBM12774
NameBDBM12761
Synonyms:1-(3-carbamimidoylphenyl)-N-[2-fluoro-4-(5-methyl-1H-1,3-benzodiazol-1-yl)phenyl]-3-(trifluoromethyl)-1H-pyrazole-5-carboxamide | pyrazole analog 3j
TypeSmall organic molecule
Emp. Form.C26H19F4N7O
Mol. Mass.521.469
SMILESCc1ccc2n(cnc2c1)-c1ccc(NC(=O)c2cc(nn2-c2cccc(c2)C(N)=N)C(F)(F)F)c(F)c1