Reaction Details
TargetNon-receptor tyrosine-protein kinase TYK2
LigandBDBM333120
Substrate/Competitorn/a
Meas. Tech.Biochemical JAK Kinase Assays
Ki 0.320±n/a nM
Citation Fatheree, PRBrandt, GESmith, CSullivan, SDVan Orden, LJ JAK inhibitors containing a 4-membered heterocyclic amide US Patent US10196393 Publication Date 2/5/2019
 
Non-receptor tyrosine-protein kinase TYK2
Name:Non-receptor tyrosine-protein kinase TYK2
Type:Protein
Mol. Mass.:133666.03
Organism:Homo sapiens (Human)
Description:P29597
Residue:1187
BDBM333120
NameBDBM333120
Synonyms:(S)-(3-(dimethylamino)azetidin-1-yl)(2-(6-(2-ethyl-5-fluoro-4-hydroxyphenyl)-1H-indazol-3-yl)-5-isopropyl-4,5,6,7-tetrahydro-3H-imidazo[4,5-c]pyridin-6-yl)methanone US10550118, Example 8-7 US10947229, Example C-1 US11634419, Example C-1 | US11702415, Compound C-1
TypeSmall organic molecule
Emp. Form.C30H36FN7O2
Mol. Mass.545.6509
SMILESCCc1cc(O)c(F)cc1-c1ccc2c(n[nH]c2c1)-c1nc2C[C@H](N(Cc2[nH]1)C(C)C)C(=O)N1CC(C1)N(C)C