Reaction Details
TargetTyrosine-protein kinase JAK1
LigandBDBM333144
Substrate/Competitorn/a
Meas. Tech.Biochemical JAK Kinase Assays
Ki 0.060±n/a nM
Citation Fatheree, PRBrandt, GESmith, CSullivan, SDVan Orden, LJ JAK inhibitors containing a 4-membered heterocyclic amide US Patent US10196393 Publication Date 2/5/2019
 
Tyrosine-protein kinase JAK1
Name:Tyrosine-protein kinase JAK1
Type:Protein
Mol. Mass.:133293.73
Organism:Homo sapiens (Human)
Description:P23458
Residue:1154
BDBM333144
NameBDBM333144
Synonyms:(S)-(3-(dimethylamino)azetidin-1-yl)(5-ethyl-2-(6-(2-ethyl-5-fluoro-4-hydroxyphenyl)-1H-indazol-3-yl)-4,5,6,7-tetrahydro-3H-imidazo[4,5-c]pyridin-6-yl)methanone US10550118, Example 8-22 US11453668, Example 8-22 | US11634419, Example C-2
TypeSmall organic molecule
Emp. Form.C29H34FN7O2
Mol. Mass.531.6244
SMILESCCN1Cc2[nH]c(nc2C[C@H]1C(=O)N1CC(C1)N(C)C)-c1n[nH]c2cc(ccc12)-c1cc(F)c(O)cc1CC