Reaction Details
TargetCoagulation factor X
LigandBDBM12780
Substrate/CompetitorBDBM12658
Meas. Tech.Enzyme Assay and Determination of the Inhibition Constants.
pH7±n/a
Temperature295.15±n/a K
Ki 3±n/a nM
Citation Batt, DGQiao, JXModi, DPHoughton, GCPierson, DARossi, KALuettgen, JMKnabb, RMJadhav, PKWexler, RR 5-Amidinoindoles as dual inhibitors of coagulation factors IXa and Xa. Bioorg Med Chem Lett14:5269-73 (2004) 
 
Coagulation factor X
Name:Coagulation factor X
Type:Enzyme
Mol. Mass.:54726.60
Organism:Homo sapiens (Human)
Description:n/a
Residue:488
BDBM12780
BDBM12658
NameBDBM12780
Synonyms:5-amidinoindole 14 | N-[4-(1H-1,3-benzodiazol-1-yl)phenyl]-2-(5-carbamimidoyl-1H-indol-3-yl)propanamide
TypeSmall organic molecule
Emp. Form.C25H22N6O
Mol. Mass.422.4818
SMILESCC(C(=O)Nc1ccc(cc1)-n1cnc2ccccc12)c1c[nH]c2ccc(cc12)C(N)=N