Reaction Details
TargetCoagulation factor X
LigandBDBM12795
Substrate/CompetitorBDBM12658
Meas. Tech.Enzyme Assay and Determination of the Inhibition Constants.
pH7±n/a
Temperature295.15±n/a K
Ki 72±n/a nM
Citation Batt, DGQiao, JXModi, DPHoughton, GCPierson, DARossi, KALuettgen, JMKnabb, RMJadhav, PKWexler, RR 5-Amidinoindoles as dual inhibitors of coagulation factors IXa and Xa. Bioorg Med Chem Lett14:5269-73 (2004) 
 
Coagulation factor X
Name:Coagulation factor X
Type:Enzyme
Mol. Mass.:54726.60
Organism:Homo sapiens (Human)
Description:n/a
Residue:488
BDBM12795
BDBM12658
NameBDBM12795
Synonyms:5-amidinoindole 29 | N-{[4-(1H-1,3-benzodiazol-1-yl)phenyl]methyl}-2-(5-carbamimidoyl-1H-indol-3-yl)-3-phenylpropanamide
TypeSmall organic molecule
Emp. Form.C32H28N6O
Mol. Mass.512.6043
SMILESNC(=N)c1ccc2[nH]cc(C(Cc3ccccc3)C(=O)NCc3ccc(cc3)-n3cnc4ccccc34)c2c1