Reaction Details
TargetCoagulation factor X
LigandBDBM12798
Substrate/CompetitorBDBM12658
Meas. Tech.Enzyme Assay and Determination of the Inhibition Constants.
pH7±n/a
Temperature295.15±n/a K
Ki 79±n/a nM
Citation Batt, DGQiao, JXModi, DPHoughton, GCPierson, DARossi, KALuettgen, JMKnabb, RMJadhav, PKWexler, RR 5-Amidinoindoles as dual inhibitors of coagulation factors IXa and Xa. Bioorg Med Chem Lett14:5269-73 (2004) 
 
Coagulation factor X
Name:Coagulation factor X
Type:Enzyme
Mol. Mass.:54726.60
Organism:Homo sapiens (Human)
Description:n/a
Residue:488
BDBM12798
BDBM12658
NameBDBM12798
Synonyms:2-(5-carbamimidoyl-1H-indol-3-yl)-3-phenyl-N-[4-(4-phenyl-1H-imidazol-1-yl)phenyl]propanamide | 5-amidinoindole 32
TypeSmall organic molecule
Emp. Form.C33H28N6O
Mol. Mass.524.615
SMILESNC(=N)c1ccc2[nH]cc(C(Cc3ccccc3)C(=O)Nc3ccc(cc3)-n3cnc(c3)-c3ccccc3)c2c1