Reaction Details
TargetMitogen-activated protein kinase 7
LigandBDBM50434069
Substrate/Competitorn/a
Meas. Tech.ERK5 Kinase Activity In Vitro Assay
pH7.5±n/a
IC50 199±12 nM
EC50 260±40 nM
Commentsextracted
Citation Gray, NSWaller, DChoi, HGWang, JDeng, X Pyrimido-diazepinone compounds and methods of treating disorders US Patent US9676792 Publication Date 6/13/2017
 
Mitogen-activated protein kinase 7
Name:Mitogen-activated protein kinase 7
Type:Protein
Mol. Mass.:88377.36
Organism:Homo sapiens (Human)
Description:Q13164
Residue:816
BDBM50434069
NameBDBM50434069
Synonyms:CHEMBL2381339 | US9676792, Compound 24
TypeSmall organic molecule
Emp. Form.C32H38N8O3
Mol. Mass.582.6959
SMILESCOc1cc(ccc1Nc1ncc2N(C)C(=O)c3cccc4CCN(c34)c2n1)C(=O)N1CCC(CC1)N1CCN(C)CC1