Reaction Details
TargetAdenosine receptor A3
LigandBDBM333246
Substrate/Competitorn/a
Meas. Tech.Assay for Binding Affinity for Adenosine Receptor A3
Ki<10±n/a nM
Citation Lee, JKim, SKim, DAhn, KLee, GKim, DHwang, H Compounds antagonizing A3 adenosine receptor, method for preparing them, and medical-use thereof US Patent US10196396 Publication Date 2/5/2019
 
Adenosine receptor A3
Name:Adenosine receptor A3
Type:G Protein-Coupled Receptor (GPCR)
Mol. Mass.:36197.32
Organism:Homo sapiens (Human)
Description:P0DMS8
Residue:318
BDBM333246
NameBDBM333246
Synonyms:(2S,3R,4S)-2-(8-((4-methylpiperazin-1-yl)amino)-[1,2,4]triazolo[4,3-a]pyrazin-3-yl)tetrahydrothiophene-3,4-diol | US10196396, Compound 41
TypeSmall organic molecule
Emp. Form.C14H21N7O2S
Mol. Mass.351.427
SMILESCN1CCN(CC1)Nc1nccn2c(nnc12)[C@@H]1SC[C@@H](O)[C@H]1O