Reaction Details
TargetCoagulation factor X
LigandBDBM12840
Substrate/CompetitorBDBM12658
Meas. Tech.Enzyme Assay and Determination of the Inhibition Constants.
pH7±n/a
Temperature295.15±n/a K
Ki 0.1±n/a nM
Citation Quan, MLHan, QFevig, JMLam, PYBai, SKnabb, RMLuettgen, JMWong, PCWexler, RR Aminobenzisoxazoles with biaryl P4 moieties as potent, selective, and orally bioavailable factor Xa inhibitors. Bioorg Med Chem Lett16:1795-8 (2006) 
 
Coagulation factor X
Name:Coagulation factor X
Type:Enzyme
Mol. Mass.:54726.60
Organism:Homo sapiens (Human)
Description:n/a
Residue:488
BDBM12840
BDBM12658
NameBDBM12840
Synonyms:1-(3-amino-1,2-benzoxazol-5-yl)-N-{2-fluoro-4-[2-(pyrrolidin-1-ylmethyl)phenyl]phenyl}-3-(trifluoromethyl)-1H-pyrazole-5-carboxamide | Aminobenzisoxazole 2i
TypeSmall organic molecule
Emp. Form.C29H24F4N6O2
Mol. Mass.564.5335
SMILESNc1noc2ccc(cc12)-n1nc(cc1C(=O)Nc1ccc(cc1F)-c1ccccc1CN1CCCC1)C(F)(F)F