Reaction Details
TargetCoagulation factor X
LigandBDBM12842
Substrate/CompetitorBDBM12658
Meas. Tech.Enzyme Assay and Determination of the Inhibition Constants.
pH7±n/a
Temperature295.15±n/a K
Ki 0.16±n/a nM
Citation Quan, MLHan, QFevig, JMLam, PYBai, SKnabb, RMLuettgen, JMWong, PCWexler, RR Aminobenzisoxazoles with biaryl P4 moieties as potent, selective, and orally bioavailable factor Xa inhibitors. Bioorg Med Chem Lett16:1795-8 (2006) 
 
Coagulation factor X
Name:Coagulation factor X
Type:Enzyme
Mol. Mass.:54726.60
Organism:Homo sapiens (Human)
Description:n/a
Residue:488
BDBM12842
BDBM12658
NameBDBM12842
Synonyms:1-(3-amino-1,2-benzoxazol-5-yl)-N-[2-fluoro-4-(2-{[(3R)-3-hydroxypyrrolidin-1-yl]methyl}phenyl)phenyl]-3-(trifluoromethyl)-1H-pyrazole-5-carboxamide | Aminobenzisoxazole 2k
TypeSmall organic molecule
Emp. Form.C29H24F4N6O3
Mol. Mass.580.5329
SMILESNc1noc2ccc(cc12)-n1nc(cc1C(=O)Nc1ccc(cc1F)-c1ccccc1CN1CC[C@@H](O)C1)C(F)(F)F