Reaction Details
TargetCoagulation factor X
LigandBDBM12855
Substrate/CompetitorBDBM12658
Meas. Tech.Enzyme Assay and Determination of the Inhibition Constants.
pH7±n/a
Temperature295.15±n/a K
Ki 0.53±n/a nM
Citation Li, YLFevig, JMCacciola, JBuriak, JRossi, KAJona, JKnabb, RMLuettgen, JMWong, PCBai, SAWexler, RRLam, PY Preparation of 1-(3-aminobenzo[d]isoxazol-5-yl)-1H-pyrazolo[4,3-d]pyrimidin-7(6H)-ones as potent, selective, and efficacious inhibitors of coagulation factor Xa. Bioorg Med Chem Lett16:5176-82 (2006) 
 
Coagulation factor X
Name:Coagulation factor X
Type:Enzyme
Mol. Mass.:54726.60
Organism:Homo sapiens (Human)
Description:n/a
Residue:488
BDBM12855
BDBM12658
NameBDBM12855
Synonyms:1-(3-amino-1,2-benzoxazol-5-yl)-6-(4-{2-[(dimethylamino)methyl]phenyl}phenyl)-3-methyl-1H,6H,7H-pyrazolo[4,3-d]pyrimidin-7-one | Pyrazolo[4,3-d]pyrimidinone 19a
TypeSmall organic molecule
Emp. Form.C28H25N7O2
Mol. Mass.491.5438
SMILESCN(C)Cc1ccccc1-c1ccc(cc1)-n1cnc2c(C)nn(-c3ccc4onc(N)c4c3)c2c1=O