Reaction Details
TargetCoagulation factor X
LigandBDBM12687
Substrate/CompetitorBDBM12658
Meas. Tech.Enzyme Assay and Determination of the Inhibition Constants.
pH7±n/a
Temperature295.15±n/a K
Ki 0.25±n/a nM
Citation Li, YLFevig, JMCacciola, JBuriak, JRossi, KAJona, JKnabb, RMLuettgen, JMWong, PCBai, SAWexler, RRLam, PY Preparation of 1-(3-aminobenzo[d]isoxazol-5-yl)-1H-pyrazolo[4,3-d]pyrimidin-7(6H)-ones as potent, selective, and efficacious inhibitors of coagulation factor Xa. Bioorg Med Chem Lett16:5176-82 (2006) 
 
Coagulation factor X
Name:Coagulation factor X
Type:Enzyme
Mol. Mass.:54726.60
Organism:Homo sapiens (Human)
Description:n/a
Residue:488
BDBM12687
BDBM12658
NameBDBM12687
Synonyms:1-(3-amino-1,2-benzoxazol-5-yl)-6-(4-{2-[(dimethylamino)methyl]phenyl}phenyl)-3-(trifluoromethyl)-1H,4H,5H,6H,7H-pyrazolo[4,3-d]pyrimidin-7-one dihydropyrazolo[4,3-d]pyrimidinone 24a
TypeSmall organic molecule
Emp. Form.C28H24F3N7O2
Mol. Mass.547.5311
SMILESCN(C)Cc1ccccc1-c1ccc(cc1)N1CNc2c(nn(c2C1=O)-c1ccc2onc(N)c2c1)C(F)(F)F