Reaction Details
TargetCoagulation factor X
LigandBDBM12873
Substrate/CompetitorBDBM12658
Meas. Tech.Enzyme Assay and Determination of the Inhibition Constants.
pH7±n/a
Temperature295.15±n/a K
Ki 0.77±n/a nM
Citation Li, YLFevig, JMCacciola, JBuriak, JRossi, KAJona, JKnabb, RMLuettgen, JMWong, PCBai, SAWexler, RRLam, PY Preparation of 1-(3-aminobenzo[d]isoxazol-5-yl)-1H-pyrazolo[4,3-d]pyrimidin-7(6H)-ones as potent, selective, and efficacious inhibitors of coagulation factor Xa. Bioorg Med Chem Lett16:5176-82 (2006) 
 
Coagulation factor X
Name:Coagulation factor X
Type:Enzyme
Mol. Mass.:54726.60
Organism:Homo sapiens (Human)
Description:n/a
Residue:488
BDBM12873
BDBM12658
NameBDBM12873
Synonyms:5-amino-1-(3-amino-1,2-benzoxazol-5-yl)-6-(4-{2-[(4-hydroxypiperidin-1-yl)methyl]phenyl}phenyl)-3-(trifluoromethyl)-1H,4H,7H-pyrazolo[4,3-b]pyridin-7-one | pyrazolo[4,3-b]pyridinone 26e
TypeSmall organic molecule
Emp. Form.C32H28F3N7O3
Mol. Mass.615.605
SMILESNc1noc2ccc(cc12)-n1nc(c2nc(N)c(-c3ccc(cc3)-c3ccccc3CN3CCC(O)CC3)c(O)c12)C(F)(F)F