Reaction Details
TargetProthrombin
LigandBDBM12861
Substrate/CompetitorBDBM12678
Meas. Tech.Enzyme Assay and Determination of the Inhibition Constants.
pH7±n/a
Temperature295.15±n/a K
Ki 245±n/a nM
Citation Li, YLFevig, JMCacciola, JBuriak, JRossi, KAJona, JKnabb, RMLuettgen, JMWong, PCBai, SAWexler, RRLam, PY Preparation of 1-(3-aminobenzo[d]isoxazol-5-yl)-1H-pyrazolo[4,3-d]pyrimidin-7(6H)-ones as potent, selective, and efficacious inhibitors of coagulation factor Xa. Bioorg Med Chem Lett16:5176-82 (2006) 
 
Prothrombin
Name:Prothrombin
Type:Protein
Mol. Mass.:70029.57
Organism:Homo sapiens (Human)
Description:P00734
Residue:622
BDBM12861
BDBM12678
NameBDBM12861
Synonyms:1-(3-amino-1,2-benzoxazol-5-yl)-6-[4-(2-{[(3R)-3-hydroxypyrrolidin-1-yl]methyl}phenyl)phenyl]-3,5-dimethyl-1H,6H,7H-pyrazolo[4,3-d]pyrimidin-7-one | Pyrazolo[4,3-d]pyrimidinone 19g
TypeSmall organic molecule
Emp. Form.C31H29N7O3
Mol. Mass.547.6071
SMILESCc1nn(-c2ccc3onc(N)c3c2)c2c1nc(C)n(-c1ccc(cc1)-c1ccccc1CN1CC[C@@H](O)C1)c2=O