Reaction Details
TargetCarbonic anhydrase 1
LigandBDBM12918
Substrate/CompetitorBDBM10856
Meas. Tech.CA Inhibition Assay
pH7.5±n/a
Temperature298.15±n/a K
Ki 5600±n/a nM
Citation Wilkinson, BLBornaghi, LFHouston, TAInnocenti, ASupuran, CTPoulsen, SA A novel class of carbonic anhydrase inhibitors: glycoconjugate benzene sulfonamides prepared by "click-tailing". J Med Chem49:6539-48 (2006) 
 
Carbonic anhydrase 1
Name:Carbonic anhydrase 1
Type:Enzyme
Mol. Mass.:28873.37
Organism:Homo sapiens (Human)
Description:P00915
Residue:261
BDBM12918
BDBM10856
NameBDBM12918
Synonyms:4-({[4-(Aminosulfonyl)benzoyl]amino}methyl-1-(2,3,4,6-tetra-O-acetyl-beta-D-glucopyranosyl)-1H-1,2,3-triazole Glycoconjugate Benzene Sulfonamide 2a | [(2R,3R,4S,5R,6R)-3,4,5-tris(acetyloxy)-6-(4-{[(4-sulfamoylphenyl)formamido]methyl}-1H-1,2,3-triazol-1-yl)oxan-2-yl]methyl acetate
TypeSmall organic molecule
Emp. Form.C24H29N5O12S
Mol. Mass.611.578
SMILESCC(=O)OC[C@H]1O[C@H]([C@H](OC(C)=O)[C@@H](OC(C)=O)[C@@H]1OC(C)=O)n1cc(CNC(=O)c2ccc(cc2)S(N)(=O)=O)nn1