Reaction Details
TargetPhosphatidylinositol 4,5-bisphosphate 3-kinase catalytic subunit delta isoform
LigandBDBM333995
Substrate/Competitorn/a
Meas. Tech.Biochemical Assay
IC50 1.60±n/a nM
Citation Achab, AAAltman, MDDeng, YGuzi, TKattar, SKatz, JDMethot, JLZhou, HMcGowan, MChristopher, MPGarcia, YAnthony, NJFradera Llinas, FXFong, KCLeng, XMu, CZhang, SZhang, R Purine inhibitors of human phosphatidylinositol 3-kinase delta US Patent US9730940 Publication Date 8/15/2017
 
Phosphatidylinositol 4,5-bisphosphate 3-kinase catalytic subunit delta isoform
Name:Phosphatidylinositol 4,5-bisphosphate 3-kinase catalytic subunit delta isoform
Type:Enzyme Subunit
Mol. Mass.:119489.41
Organism:Homo sapiens (Human)
Description:O00329
Residue:1044
BDBM333995
NameBDBM333995
Synonyms:(S)-1-(3-((8-(2-(tert- butyl)thiazol-5-yl)-9-methyl-9H- purin-6-yl)oxy)pyrrolidin-1- yl)propan-1-one | US9730940, Compound 2-96
TypeSmall organic molecule
Emp. Form.C20H26N6O2S
Mol. Mass.414.524
SMILESCCC(=O)N1CCC(C1)Oc1ncnc2n(C)c(nc12)-c1cnc(s1)C(C)(C)C