Reaction Details
TargetPhosphatidylinositol 4,5-bisphosphate 3-kinase catalytic subunit delta isoform
LigandBDBM334043
Substrate/Competitorn/a
Meas. Tech.Biochemical Assay
IC50 1.000±n/a nM
Citation Achab, AAAltman, MDDeng, YGuzi, TKattar, SKatz, JDMethot, JLZhou, HMcGowan, MChristopher, MPGarcia, YAnthony, NJFradera Llinas, FXFong, KCLeng, XMu, CZhang, SZhang, R Purine inhibitors of human phosphatidylinositol 3-kinase delta US Patent US9730940 Publication Date 8/15/2017
 
Phosphatidylinositol 4,5-bisphosphate 3-kinase catalytic subunit delta isoform
Name:Phosphatidylinositol 4,5-bisphosphate 3-kinase catalytic subunit delta isoform
Type:Enzyme Subunit
Mol. Mass.:119489.41
Organism:Homo sapiens (Human)
Description:O00329
Residue:1044
BDBM334043
NameBDBM334043
Synonyms:6-{[(3S)-1- (cyclopropylcarbonyl)pyrrolidin- 3-yl]oxy}-9-ethyl-8-(6- methoxypyridin-3-yl)-9H-purine | US9730940, Compound 2-143
TypeSmall organic molecule
Emp. Form.C21H24N6O3
Mol. Mass.408.4537
SMILESCCn1c(nc2c(O[C@H]3CCN(C3)C(=O)C3CC3)ncnc12)-c1ccc(OC)nc1