Reaction Details
TargetPhosphatidylinositol 4,5-bisphosphate 3-kinase catalytic subunit delta isoform
LigandBDBM334128
Substrate/Competitorn/a
Meas. Tech.Biochemical Assay
IC50 1.30±n/a nM
Citation Achab, AAAltman, MDDeng, YGuzi, TKattar, SKatz, JDMethot, JLZhou, HMcGowan, MChristopher, MPGarcia, YAnthony, NJFradera Llinas, FXFong, KCLeng, XMu, CZhang, SZhang, R Purine inhibitors of human phosphatidylinositol 3-kinase delta US Patent US9730940 Publication Date 8/15/2017
 
Phosphatidylinositol 4,5-bisphosphate 3-kinase catalytic subunit delta isoform
Name:Phosphatidylinositol 4,5-bisphosphate 3-kinase catalytic subunit delta isoform
Type:Enzyme Subunit
Mol. Mass.:119489.41
Organism:Homo sapiens (Human)
Description:O00329
Residue:1044
BDBM334128
NameBDBM334128
Synonyms:(R or S )-6-{[5- (cyclopropylcarbonyl)-5- azaspiro[2.4]hept-7-yl]oxy}-9- ethyl-8-(2-methylpyrimidin-5- yl)-9H-purine US9730940, Compound 3-64
TypeSmall organic molecule
Emp. Form.C22H25N7O2
Mol. Mass.419.4796
SMILESCCn1c(nc2c(OC3CN(CC33CC3)C(=O)C3CC3)ncnc12)-c1cnc(C)nc1