Reaction Details
TargetNitric oxide synthase, inducible
LigandBDBM50446248
Substrate/Competitorn/a
Meas. Tech.Inhibition Assay
Ki 2316±n/a nM
Citation Silverman, RBJing, Q 2-aminopyridine-based selective neuronal nitric oxide synthase inhibitors US Patent US9732037 Publication Date 8/15/2017
 
Nitric oxide synthase, inducible
Name:Nitric oxide synthase, inducible
Type:Homodimer
Mol. Mass.:131141.95
Organism:Homo sapiens (Human)
Description:P35228
Residue:1153
BDBM50446248
NameBDBM50446248
Synonyms:CHEMBL3109190 | US9732037, Compound 10
TypeSmall organic molecule
Emp. Form.C21H31N5O3
Mol. Mass.401.5025
SMILESCc1cc(N)nc(COCCOC[C@@H]2C[C@H](CN2)OCc2cc(C)cc(N)n2)c1