Reaction Details
TargetAndrogen receptor
LigandBDBM334275
Substrate/Competitorn/a
Meas. Tech.Biological Assay
Kd 100.0±n/a nM
Citation Poinsard, C N-(pyrid-4-yl)amides and N-(pyrimidin-4-yl)amides and their pharmaceutical and cosmetic use US Patent US9732044 Publication Date 8/15/2017
 
Androgen receptor
Name:Androgen receptor
Type:Receptor
Mol. Mass.:99185.27
Organism:Homo sapiens (Human)
Description:CHO cells were stably transfected with human AR gene.
Residue:920
BDBM334275
NameBDBM334275
Synonyms:N-(2-Bromo- pyridin-4-yl)-2- hydroxy-2-phenyl- propionamide | US9732044, 32
TypeSmall organic molecule
Emp. Form.C14H13BrN2O2
Mol. Mass.321.169
SMILESCC(O)(C(=O)Nc1ccnc(Br)c1)c1ccccc1