Reaction Details
TargetCoagulation factor XI
LigandBDBM12962
Substrate/CompetitorBDBM12947
Meas. Tech.Enzyme Inhibition Assay
IC50 10±n/a nM
Citation Lin, JDeng, HJin, LPandey, PQuinn, JCantin, SRynkiewicz, MJGorga, JCBibbins, FCelatka, CANagafuji, PBannister, TDMeyers, HVBabine, REHayward, NJWeaver, DBenjamin, HStassen, FAbdel-Meguid, SSStrickler, JE Design, synthesis, and biological evaluation of peptidomimetic inhibitors of factor XIa as novel anticoagulants. J Med Chem49:7781-91 (2006) 
 
Coagulation factor XI
Name:Coagulation factor XI
Type:Enzyme
Mol. Mass.:70130.58
Organism:Homo sapiens (Human)
Description:P03951
Residue:625
BDBM12962
BDBM12947
NameBDBM12962
Synonyms:(2S)-2-({[1-(4-bromophenyl)ethyl]carbamoyl}amino)-N-[(1S)-1-{[(2S)-5-carbamimidamido-1-oxo-1-(1,3-thiazol-2-yl)pentan-2-yl]carbamoyl}-2-methylpropyl]-4-methylpentanamide | alpha-ketothiazole analogue 22
TypeSmall organic molecule
Emp. Form.C29H43BrN8O4S
Mol. Mass.679.672
SMILES[#6]-[#6](-[#6])-[#6]-[#6@H](-[#7]-[#6](=O)-[#7]-[#6](-[#6])-c1ccc(Br)cc1)-[#6](=O)-[#7]-[#6@@H](-[#6](-[#6])-[#6])-[#6](=O)-[#7]-[#6@@H](-[#6]-[#6]-[#6]\[#7]=[#6](/[#7])-[#7])-[#6](=O)-c1nccs1