Reaction Details
TargetCoagulation factor XI
LigandBDBM12973
Substrate/CompetitorBDBM12947
Meas. Tech.Enzyme Inhibition Assay
IC50 7±n/a nM
Citation Lin, JDeng, HJin, LPandey, PQuinn, JCantin, SRynkiewicz, MJGorga, JCBibbins, FCelatka, CANagafuji, PBannister, TDMeyers, HVBabine, REHayward, NJWeaver, DBenjamin, HStassen, FAbdel-Meguid, SSStrickler, JE Design, synthesis, and biological evaluation of peptidomimetic inhibitors of factor XIa as novel anticoagulants. J Med Chem49:7781-91 (2006) 
 
Coagulation factor XI
Name:Coagulation factor XI
Type:Enzyme
Mol. Mass.:70130.58
Organism:Homo sapiens (Human)
Description:P03951
Residue:625
BDBM12973
BDBM12947
NameBDBM12973
Synonyms:(2S)-2-({[(1R)-1-(4-bromophenyl)ethyl]carbamoyl}amino)-5-carbamimidamido-N-[(1S)-1-{[(2S)-5-carbamimidamido-1-oxo-1-(1,3-thiazol-2-yl)pentan-2-yl]carbamoyl}-2-methylpropyl]pentanamide | alpha-ketothiazole analogue 33
TypeSmall organic molecule
Emp. Form.C29H44BrN11O4S
Mol. Mass.722.7
SMILES[#6]-[#6](-[#6])-[#6@H](-[#7]-[#6](=O)-[#6@H](-[#6]-[#6]-[#6]\[#7]=[#6](\[#7])-[#7])-[#7]-[#6](=O)-[#7]-[#6@H](-[#6])-c1ccc(Br)cc1)-[#6](=O)-[#7]-[#6@@H](-[#6]-[#6]-[#6]\[#7]=[#6](/[#7])-[#7])-[#6](=O)-c1nccs1