Reaction Details
TargetCoagulation factor XI
LigandBDBM12975
Substrate/CompetitorBDBM12947
Meas. Tech.Enzyme Inhibition Assay
IC50 29±n/a nM
Citation Lin, JDeng, HJin, LPandey, PQuinn, JCantin, SRynkiewicz, MJGorga, JCBibbins, FCelatka, CANagafuji, PBannister, TDMeyers, HVBabine, REHayward, NJWeaver, DBenjamin, HStassen, FAbdel-Meguid, SSStrickler, JE Design, synthesis, and biological evaluation of peptidomimetic inhibitors of factor XIa as novel anticoagulants. J Med Chem49:7781-91 (2006) 
 
Coagulation factor XI
Name:Coagulation factor XI
Type:Enzyme
Mol. Mass.:70130.58
Organism:Homo sapiens (Human)
Description:P03951
Residue:625
BDBM12975
BDBM12947
NameBDBM12975
Synonyms:(2S)-2-[(2S)-2-({[(1R)-1-(4-bromophenyl)ethyl]carbamoyl}amino)-3-(1H-indol-3-yl)propanamido]-N-[(2S)-5-carbamimidamido-1-oxo-1-(1,3-thiazol-2-yl)pentan-2-yl]-3-methylbutanamide | alpha-ketothiazole analogue 35
TypeSmall organic molecule
Emp. Form.C34H42BrN9O4S
Mol. Mass.752.724
SMILESCC(C)[C@H](NC(=O)[C@H](Cc1c[nH]c2ccccc12)NC(=O)N[C@H](C)c1ccc(Br)cc1)C(=O)N[C@@H](CCCN=C(N)N)C(=O)c1nccs1