Reaction Details
TargetProto-oncogene tyrosine-protein kinase Src
LigandBDBM334346
Substrate/Competitorn/a
Meas. Tech.Enzyme Inhibition Assay
IC50 4.00±n/a nM
Citation Frickel, FFyfe, MCMeghani, PThom, SM Kinase inhibitors US Patent US9732063 Publication Date 8/15/2017
 
Proto-oncogene tyrosine-protein kinase Src
Name:Proto-oncogene tyrosine-protein kinase Src
Type:Protein
Mol. Mass.:59838.60
Organism:Homo sapiens (Human)
Description:P12931
Residue:536
BDBM334346
NameBDBM334346
Synonyms:1-(4-((2-((3-(2,5,8,11,14-Pentaoxahexadecan-16-yloxy)-5-methoxyphenyl)amino)-pyrimidin-4-yl)oxy)naphthalen-1-yl)-3-(3-isopropyl-1-(p-tolyl)-1H-pyrazol-5-yl)urea | US9732063, Example 30
TypeSmall organic molecule
Emp. Form.C46H55N7O9
Mol. Mass.849.9704
c1cc(Nc2nccc(Oc3ccc(NC(=O)Nc4cc(nn4-c4ccc(C)cc4)C(C)C)c4ccccc34)n2)cc(OC)c1