Reaction Details
TargetMitogen-activated protein kinase 12
LigandBDBM334354
Substrate/Competitorn/a
Meas. Tech.Enzyme Inhibition Assay
IC50 132±n/a nM
Citation Frickel, FFyfe, MCMeghani, PThom, SM Kinase inhibitors US Patent US9732063 Publication Date 8/15/2017
 
Mitogen-activated protein kinase 12
Name:Mitogen-activated protein kinase 12
Type:Protein
Mol. Mass.:41938.69
Organism:Homo sapiens (Human)
Description:P53778
Residue:367
BDBM334354
NameBDBM334354
Synonyms:1-(3-(tert-Butyl)-1-(6-methoxypyridin-3-yl)-1H-pyrazol-5-yl)-3-(4-((2-((3-methoxy-5-(2-(2-(2-methoxyethoxyl)ethoxy)ethoxy)phenyl)amino)pyrimidin-4-yl)oxy)naphthalen-1-yl)urea | US9732063, Example 38
TypeSmall organic molecule
Emp. Form.C42H48N8O8
Mol. Mass.792.8793
SMILESCOCCOCCOCCOc1cc(Nc2nccc(Oc3ccc(NC(=O)Nc4cc(nn4-c4ccc(OC)nc4)C(C)(C)C)c4ccccc34)n2)cc(OC)c1