Reaction Details
TargetMitogen-activated protein kinase 12
LigandBDBM334360
Substrate/Competitorn/a
Meas. Tech.Enzyme Inhibition Assay
IC50 103±n/a nM
Citation Frickel, FFyfe, MCMeghani, PThom, SM Kinase inhibitors US Patent US9732063 Publication Date 8/15/2017
 
Mitogen-activated protein kinase 12
Name:Mitogen-activated protein kinase 12
Type:Protein
Mol. Mass.:41938.69
Organism:Homo sapiens (Human)
Description:P53778
Residue:367
BDBM334360
NameBDBM334360
Synonyms:1-(3-(tert-Butyl)-1-(4-methoxyphenyl)-1H-pyrazol-5-yl)-3-(4-((2-((3-methoxy-5-(2-(2-(2-methoxyethoxy)ethoxy)ethoxy)phenyl)amino)pyrimidin-4-yl)oxy)naphthalen-1-yl)urea | US9732063, Example 44
TypeSmall organic molecule
Emp. Form.C43H49N7O8
Mol. Mass.791.8913
SMILESCOCCOCCOCCOc1cc(Nc2nccc(Oc3ccc(NC(=O)Nc4cc(nn4-c4ccc(OC)cc4)C(C)(C)C)c4ccccc34)n2)cc(OC)c1