Reaction Details
TargetProto-oncogene tyrosine-protein kinase Src
LigandBDBM334376
Substrate/Competitorn/a
Meas. Tech.Enzyme Inhibition Assay
IC50 17.0±n/a nM
Citation Frickel, FFyfe, MCMeghani, PThom, SM Kinase inhibitors US Patent US9732063 Publication Date 8/15/2017
 
Proto-oncogene tyrosine-protein kinase Src
Name:Proto-oncogene tyrosine-protein kinase Src
Type:Protein
Mol. Mass.:59838.60
Organism:Homo sapiens (Human)
Description:P12931
Residue:536
BDBM334376
NameBDBM334376
Synonyms:1-(3-(tert-Butyl)-1-(p-tolyl)-1H-pyrazol-5-yl)-3-(4-((2-((3-methoxy-5-(2-(2-methoxyethoxy)ethoxy)phenyl)amino)pyrimidin-4-yl)oxy)naphthalen-1-yl)urea | US9732063, Example 60
TypeSmall organic molecule
Emp. Form.C41H45N7O6
Mol. Mass.731.8393
SMILESCOCCOCCOc1cc(Nc2nccc(Oc3ccc(NC(=O)Nc4cc(nn4-c4ccc(C)cc4)C(C)(C)C)c4ccccc34)n2)cc(OC)c1