Reaction Details
TargetCoagulation factor X
LigandBDBM12999
Substrate/CompetitorBDBM12989
Meas. Tech.Enzyme Inhibition Assay
pH8.3±n/a
Temperature298.15±n/a K
IC50 2.5±n/a nM
Citation Roehrig, SStraub, APohlmann, JLampe, TPernerstorfer, JSchlemmer, KHReinemer, PPerzborn, E Discovery of the novel antithrombotic agent 5-chloro-N-({(5S)-2-oxo-3-[4-(3-oxomorpholin-4-yl)phenyl]-1,3-oxazolidin-5-yl}methyl)thiophene-2-carboxamide (BAY 59-7939): an oral, direct factor Xa inhibitor. J Med Chem48:5900-8 (2005) 
 
Coagulation factor X
Name:Coagulation factor X
Type:Enzyme
Mol. Mass.:54726.60
Organism:Homo sapiens (Human)
Description:n/a
Residue:488
BDBM12999
BDBM12989
NameBDBM12999
Synonyms:BAY 59-7939 Analog 14 N-{[(5S)-3-[3-amino-4-(3-oxomorpholin-4-yl)phenyl]-2-oxo-1,3-oxazolidin-5-yl]methyl}-5-chlorothiophene-2-carboxamide
TypeSmall organic molecule
Emp. Form.C19H19ClN4O5S
Mol. Mass.450.896
SMILESNc1cc(ccc1N1CCOCC1=O)N1C[C@H](CNC(=O)c2ccc(Cl)s2)OC1=O