Reaction Details
TargetCoagulation factor X
LigandBDBM7841
Substrate/CompetitorBDBM12989
Meas. Tech.Enzyme Inhibition Assay
IC50 4.2±n/a nM
Citation Roehrig, SStraub, APohlmann, JLampe, TPernerstorfer, JSchlemmer, KHReinemer, PPerzborn, E Discovery of the novel antithrombotic agent 5-chloro-N-({(5S)-2-oxo-3-[4-(3-oxomorpholin-4-yl)phenyl]-1,3-oxazolidin-5-yl}methyl)thiophene-2-carboxamide (BAY 59-7939): an oral, direct factor Xa inhibitor. J Med Chem48:5900-8 (2005) 
 
Coagulation factor X
Name:Coagulation factor X
Type:Enzyme
Mol. Mass.:54726.60
Organism:Homo sapiens (Human)
Description:n/a
Residue:488
BDBM7841
BDBM12989
NameBDBM7841
Synonyms:BAY 59-7939 Analog 18 US9359341, Rivaroxaban
Typen/a
Emp. Form.C20H21N3O5S
Mol. Mass.415.463
SMILESCc1ccc(s1)C(=O)NC[C@H]1CN(C(=O)O1)c1ccc(cc1)N1CCOCC1=O