Reaction Details
TargetCoagulation factor X
LigandBDBM13012
Substrate/CompetitorBDBM12989
Meas. Tech.Enzyme Inhibition Assay
IC50 197±n/a nM
Citation Roehrig, SStraub, APohlmann, JLampe, TPernerstorfer, JSchlemmer, KHReinemer, PPerzborn, E Discovery of the novel antithrombotic agent 5-chloro-N-({(5S)-2-oxo-3-[4-(3-oxomorpholin-4-yl)phenyl]-1,3-oxazolidin-5-yl}methyl)thiophene-2-carboxamide (BAY 59-7939): an oral, direct factor Xa inhibitor. J Med Chem48:5900-8 (2005) 
 
Coagulation factor X
Name:Coagulation factor X
Type:Enzyme
Mol. Mass.:54726.60
Organism:Homo sapiens (Human)
Description:n/a
Residue:488
BDBM13012
BDBM12989
NameBDBM13012
Synonyms:5-Chloro-N-methyl-N-({(5S)-2-oxo-3-[4-(3-oxomorpholin-4-yl)phenyl]-1,3-oxazolidin-5-yl}methyl)thiophene-2-carboxamide BAY 59-7939 Analog 27
TypeSmall organic molecule
Emp. Form.C20H20ClN3O5S
Mol. Mass.449.908
SMILESCN(C[C@H]1CN(C(=O)O1)c1ccc(cc1)N1CCOCC1=O)C(=O)c1ccc(Cl)s1