Reaction Details
TargetCoagulation factor XI
LigandBDBM335408
Substrate/Competitorn/a
Meas. Tech.Enzyme Activity Assay
IC50 2.50±n/a nM
Citation Courtney, SYarnold, CFlanagan, SBrace, GBarker, JIchihara, OGadouleau, ERichardson, AKondo, TImagawa, ANakatani, SSuzuki, RKouyama, S Pyridinone and pyrimidinone derivatives as factor Xia US Patent US9732085 Publication Date 8/15/2017
 
Coagulation factor XI
Name:Coagulation factor XI
Type:Enzyme
Mol. Mass.:70130.58
Organism:Homo sapiens (Human)
Description:P03951
Residue:625
BDBM335408
NameBDBM335408
Synonyms:US10717738, Example 290 methyl[4-(2-{(3S)-7-[5-chloro-2-(4-cyano-1H-1,2,3-triazol-1-yl)phenyl]-5-oxo-1,2,3,5-tetrahydro-3-indolizinyl}-1H-imidazol-5-yl)phenyl]carbamate
TypeSmall organic molecule
Emp. Form.C28H21ClN8O3
Mol. Mass.552.971
SMILESCOC(=O)Nc1ccc(cc1)-c1cnc([nH]1)[C@@H]1CCc2cc(cc(=O)n12)-c1cc(Cl)ccc1-n1cc(nn1)C#N