Reaction Details
TargetCoagulation factor XI
LigandBDBM335420
Substrate/Competitorn/a
Meas. Tech.Enzyme Activity Assay
IC50 3.60±n/a nM
Citation Courtney, SYarnold, CFlanagan, SBrace, GBarker, JIchihara, OGadouleau, ERichardson, AKondo, TImagawa, ANakatani, SSuzuki, RKouyama, S Pyridinone and pyrimidinone derivatives as factor Xia US Patent US9732085 Publication Date 8/15/2017
 
Coagulation factor XI
Name:Coagulation factor XI
Type:Enzyme
Mol. Mass.:70130.58
Organism:Homo sapiens (Human)
Description:P03951
Residue:625
BDBM335420
NameBDBM335420
Synonyms:US9732085, Comp Ex 1
TypeSmall organic molecule
Emp. Form.C29H26Cl2N8O3
Mol. Mass.605.475
SMILESCOC(=O)Nc1ccc(cc1)-c1[nH]c(nc1Cl)[C@H](Cc1ccccc1)NC(=O)CCc1cc(Cl)ccc1-n1cnnn1