Reaction Details
TargetPhenylethanolamine N-methyltransferase
LigandBDBM13027
Substrate/CompetitorBDBM13015
Meas. Tech.Radiochemical Assay of PNMT Inhibitors
pH8±n/a
Temperature310.15±n/a K
Ki 23±2 nM
Citation Grunewald, GLSeim, MRRegier, RCMartin, JLGee, CLDrinkwater, NCriscione, KR Comparison of the binding of 3-fluoromethyl-7-sulfonyl-1,2,3,4-tetrahydroisoquinolines with their isosteric sulfonamides to the active site of phenylethanolamine N-methyltransferase. J Med Chem49:5424-33 (2006) 
 
Phenylethanolamine N-methyltransferase
Name:Phenylethanolamine N-methyltransferase
Type:Enzyme
Mol. Mass.:30852.66
Organism:Homo sapiens (Human)
Description:n/a
Residue:282
BDBM13027
BDBM13015
NameBDBM13027
Synonyms:3-(hydroxymethyl)-N-(2,2,2-trifluoroethyl)-1,2,3,4-tetrahydroisoquinoline-7-sulfonamide CHEMBL366785
TypeSmall organic molecule
Emp. Form.C12H15F3N2O3S
Mol. Mass.324.319
SMILESOCC1Cc2ccc(cc2CN1)S(=O)(=O)NCC(F)(F)F