Reaction Details
TargetCarbonic anhydrase 5A, mitochondrial
LigandBDBM10881
Substrate/CompetitorBDBM10856
Meas. Tech.CA Inhibition Assay
Ki 65±n/a nM
Citation Winum, JYTemperini, CEl Cheikh, KInnocenti, AVullo, DCiattini, SMontero, JLScozzafava, ASupuran, CT Carbonic anhydrase inhibitors: clash with Ala65 as a means for designing inhibitors with low affinity for the ubiquitous isozyme II, exemplified by the crystal structure of the topiramate sulfamide analogue. J Med Chem49:7024-31 (2006) 
 
Carbonic anhydrase 5A, mitochondrial
Name:Carbonic anhydrase 5A, mitochondrial
Type:Enzyme
Mol. Mass.:34755.54
Organism:Homo sapiens (Human)
Description:Human (cloned) isozyme
Residue:305
BDBM10881
BDBM10856
NameBDBM10881
Synonyms:CHEMBL288100 Methazolamide Methazolamide, MZA Sulfonamide, 2 sulfonamide 2
TypeSmall organic molecule
Emp. Form.C5H8N4O3S2
Mol. Mass.236.272
SMILESCC(=O)N=c1sc(nn1C)S(N)(=O)=O