Reaction Details
TargetCarbonic anhydrase 5A, mitochondrial
LigandBDBM13054
Substrate/CompetitorBDBM10856
Meas. Tech.CA Inhibition Assay
Ki 42±n/a nM
Citation Winum, JYTemperini, CEl Cheikh, KInnocenti, AVullo, DCiattini, SMontero, JLScozzafava, ASupuran, CT Carbonic anhydrase inhibitors: clash with Ala65 as a means for designing inhibitors with low affinity for the ubiquitous isozyme II, exemplified by the crystal structure of the topiramate sulfamide analogue. J Med Chem49:7024-31 (2006) 
 
Carbonic anhydrase 5A, mitochondrial
Name:Carbonic anhydrase 5A, mitochondrial
Type:Enzyme
Mol. Mass.:34755.54
Organism:Homo sapiens (Human)
Description:Human (cloned) isozyme
Residue:305
BDBM13054
BDBM10856
NameBDBM13054
Synonyms:(2R,4R)-4-(ethylamino)-2-methyl-1,1-dioxo-2H,3H,4H-1,7-thieno[2,3-b]thiopyran-6-sulfonamide sulfonamide 5
TypeSmall organic molecule
Emp. Form.C10H16N2O4S3
Mol. Mass.324.44
SMILESCCN[C@@H]1C[C@@H](C)S(=O)(=O)c2sc(cc12)S(N)(=O)=O